Target
Histone-lysine N-methyltransferase EZH2/Polycomb protein EED/Polycomb protein SUZ12
Ligand
BDBM451056
Substrate
Meas. Tech.
EED-H3K27Me3 Peptide Competition Binding Assay by AlphaScreen
IC50
4.50±n/a nM
Citation
 Chan, HMFu, XGu, XJHuang, YLi, LMi, YQi, WSendzik, MSun, YWang, LYu, ZZhang, HZhang, JYZhang, MZhang, QZhao, K Imidazolepyridine compounds and uses thereof US Patent  US10676479 Publication Date 6/9/2020 
Target
Name:
Histone-lysine N-methyltransferase EZH2/Polycomb protein EED/Polycomb protein SUZ12
Synonyms:
EZH2/SUZ12/EED complex | Polycomb Repressive Complex 2 (PRC2)
Type:
Protein
Mol. Mass.:
Description:
Components:
This complex has 3 components.
Component 1
Name:
Polycomb protein EED
Synonyms:
EED WAIT-1 hEED
Type:
Protein
Mol. Mass.:
50201.68
Organism:
Homo sapiens (Human)
Description:
O75530
Residue:
441
  
Component 2
Name:
Histone-lysine N-methyltransferase EZH2
Synonyms:
ENX-1 EZH2_HUMAN Histone-lysine N-methyltransferase EZH2 Lysine N-methyltransferase 6
Type:
Protein
Mol. Mass.:
85367.84
Organism:
Homo sapiens (Human)
Description:
Q15910
Residue:
746
  
Component 3
Name:
Polycomb protein SUZ12
Synonyms:
CHET9 Chromatin precipitated E2F target 9 protein Joined to JAZF1 protein Polycomb protein SUZ12 SUZ12 Suppressor of zeste 12 protein homolog
Type:
Protein
Mol. Mass.:
83080.09
Organism:
Homo sapiens (Human)
Description:
Q15022
Residue:
739
  
Inhibitor
Name:
BDBM451056
Synonyms:
5-(((5-fluoro-2,3-dihydrobenzofuran-4- | US10676479, Example 86
Type:
Small organic molecule
Emp. Form.:
C25H23FN8O
Mol. Mass.:
470.5015
SMILES:
Fc1ccc2OCCc2c1CNc1ncc(-c2ccc(nc2)N2CCNCC2)c2c(ncn12)C#N
: