Target
Eukaryotic translation initiation factor 4E
Ligand
BDBM451147
Substrate
Meas. Tech.
thermodynamic (Steady State Affinity) binding analysis
Kd
6500±n/a nM
Citation
 Barnes-Seeman, DCohen, SLDiener, JLGampe, CRoache, JWhite, AWilliams, SYuan, JZecri, F 3′ end caps, 5′ end caps and combinations thereof for therapeutic RNA US Patent  US10676499 Publication Date 6/9/2020 
Target
Name:
Eukaryotic translation initiation factor 4E
Synonyms:
EIF4E EIF4F Eukaryotic translation initiation factor 4E (eIF4E) IF4E_HUMAN
Type:
Protein
Mol. Mass.:
25095.44
Organism:
Homo sapiens (Human)
Description:
P06730
Residue:
217
  
Inhibitor
Name:
BDBM451147
Synonyms:
US10676499, Example 26
Type:
Small organic molecule
Emp. Form.:
C18H22N5O9P
Mol. Mass.:
483.3691
SMILES:
COc1cccc(C[n+]2cn([C@H]3O[C@@H](COP(O)(O)=O)[C@H](O)[C@@H]3O)c3nc(N)nc([O-])c23)c1
: