Target
Lysine-specific histone demethylase 1A
Ligand
BDBM103876
Substrate
Meas. Tech.
LSD1 Histone Demethylase Biochemical Assay
IC50
75±n/a nM
Citation
 Wu, LWang, XYao, WZhang, C Substituted [1,2,4]triazolo[1,5-a]pyridines and substituted [1,2,4]triazolo[1,5-a]pyrazines as LSD1 inhibitors US Patent  US10125133 Publication Date 11/13/2018 
Target
Name:
Lysine-specific histone demethylase 1A
Synonyms:
AOF2 Flavin-containing amine oxidase domain-containing protein 2 KDM1A KIAA0601 Lysine-specific demethylase 1 (LSD1) Lysine-specific histone demethylase 1 (LSD1)
Type:
Enzyme
Mol. Mass.:
92901.01
Organism:
Homo sapiens (Human)
Description:
O60341
Residue:
852
  
Inhibitor
Name:
BDBM103876
Synonyms:
US10125133, Example 3 US9695167, 3
Type:
Small organic molecule
Emp. Form.:
C27H27N5
Mol. Mass.:
421.5368
SMILES:
CN1CCC(CCc2cc(-c3ccc(cc3)C#N)c(-c3ccc(C)cc3)n3ncnc23)C1
: