Target
Activin receptor type-1 [172-499]
Ligand
BDBM451776
Substrate
Meas. Tech.
ADPGlo Assay
IC50
13.0±n/a nM
Citation
 Arista, LBabu, SBian, JCui, KDillon, MPLattmann, RLi, JLiao, LLizos, DRamos, RStiefl, NJUllrich, TUsselmann, PWang, XWaykole, LMWeiler, SZhang, YZhou, YZhu, T Aminopyridine derivatives and their use as selective ALK-2 inhibitors US Patent  US10710980 Publication Date 7/14/2020 
Target
Name:
Activin receptor type-1 [172-499]
Synonyms:
ACVR1 ACVRLK2 Activin receptor-like kinase 2 (ALK-2)(aa 172-499) | Activin receptor-like kinase 2 (ALK2)(172-499)
Type:
Enzyme Catalytic Domain
Mol. Mass.:
37139.64
Organism:
Homo sapiens (Human)
Description:
aa 172-499
Residue:
328
  
Inhibitor
Name:
BDBM451776
Synonyms:
US10710980, Example 8 | US10947218, Example 8
Type:
Small organic molecule
Emp. Form.:
C25H34FN5O2
Mol. Mass.:
455.5682
SMILES:
CC(C)N1CCN(CC1)c1ccc(c(F)c1)-c1cnc(N)c(c1)C(=O)N[C@H]1CC[C@H](O)CC1
: