Target
Estrogen receptor
Ligand
BDBM299127
Substrate
Meas. Tech.
ERalpha binding assay
IC50
9.70±n/a nM
Citation
 Yang, BVarnes, JGScott, JSMoss, TAO Donovan, DHNissink, JWHughes, SJBarlaam, BC Chemical compounds US Patent  US10125135 Publication Date 11/13/2018 
Target
Name:
Estrogen receptor
Synonyms:
ER ESR ESR1_HUMAN Estrogen receptor Estrogen receptor (ER-alpha) Estrogen receptor alpha (ER) Nuclear receptor subfamily 3 group A member 1
Type:
Protein
Mol. Mass.:
66230.44
Organism:
Homo sapiens (Human)
Description:
P03372
Residue:
595
  
Inhibitor
Name:
BDBM299127
Synonyms:
(6S,8R)-7-(2- fluoro-3- methoxy-2- methylpropyl)-6- (4-(2-(3- (fluoromethyl) azetidin-1- yl)ethoxy)-2- methoxyphenyl)- 8-methyl-6,7,8,9- tetrahydro-3H- pyrazolo[4,3- f]isoquinoline US10125135, Example 17
Type:
Small organic molecule
Emp. Form.:
C29H38F2N4O3
Mol. Mass.:
528.6338
SMILES:
COCC(C)(F)CN1[C@H](C)Cc2c(ccc3[nH]ncc23)[C@H]1c1ccc(OCCN2CC(CF)C2)cc1OC
: