Target
Advanced glycosylation end product-specific receptor
Ligand
BDBM50249571
Substrate
Meas. Tech.
High-Throughput Screening Assay
Kd
0.100±0.05 nM
Citation
 Schmidt, AMRamasamy, RShekhtman, ARai, VManigrasso, MB Amino, amido and heterocyclic compounds as modulators of RAGE activity and uses thereof US Patent  US10729695 Publication Date 8/4/2020 
Target
Name:
Advanced glycosylation end product-specific receptor
Synonyms:
AGER RAGE_HUMAN | Receptor for advanced glycosylation end products
Type:
PROTEIN
Mol. Mass.:
42800.11
Organism:
Homo sapiens (Human)
Description:
ChEMBL_1339877
Residue:
404
  
Inhibitor
Name:
BDBM50249571
Synonyms:
CHEMBL4101927 | US10729695, Compound CB-6
Type:
Small organic molecule
Emp. Form.:
C13H12ClN3O3S
Mol. Mass.:
325.771
SMILES:
COc1cc(NC(C)=O)c(Cl)cc1C(=O)Nc1nccs1
: