Target
Advanced glycosylation end product-specific receptor
Ligand
BDBM453304
Substrate
Meas. Tech.
High-Throughput Screening Assay
Kd
78.0±n/a nM
Citation
 Schmidt, AMRamasamy, RShekhtman, ARai, VManigrasso, MB Amino, amido and heterocyclic compounds as modulators of RAGE activity and uses thereof US Patent  US10729695 Publication Date 8/4/2020 
Target
Name:
Advanced glycosylation end product-specific receptor
Synonyms:
AGER RAGE_HUMAN | Receptor for advanced glycosylation end products
Type:
PROTEIN
Mol. Mass.:
42800.11
Organism:
Homo sapiens (Human)
Description:
ChEMBL_1339877
Residue:
404
  
Inhibitor
Name:
BDBM453304
Synonyms:
US10729695, Compound CD-29
Type:
Small organic molecule
Emp. Form.:
C19H19N3O
Mol. Mass.:
305.3737
SMILES:
Cc1nccn1CC(O)Cn1c2ccccc2c2ccccc12
: