Target
fMet-Leu-Phe receptor
Ligand
BDBM454196
Substrate
Meas. Tech.
cAMP Assay
EC50
15.0±n/a nM
Citation
 Wurtz, NRShirude, PS Piperidinone formyl peptide 2 receptor and formyl peptide 1 receptor agonists US Patent  US10717708 Publication Date 7/21/2020 
Target
Name:
fMet-Leu-Phe receptor
Synonyms:
FPR FPR1_HUMAN N-formyl peptide receptor 1 fMLP receptor formyl peptide receptor 1
Type:
Enzyme Catalytic Domain
Mol. Mass.:
38456.14
Organism:
Homo sapiens (Human)
Description:
gi_4503779
Residue:
350
  
Inhibitor
Name:
BDBM454196
Synonyms:
US10717708, Example 145 US11530183, Example 145
Type:
Small organic molecule
Emp. Form.:
C26H26F3N5O4S
Mol. Mass.:
561.576
SMILES:
CN(c1ncccc1-c1ccc(cc1)N1CCC[C@@H](NC(=O)Nc2ccc(cc2)C(F)(F)F)C1=O)S(C)(=O)=O
: