Target
Rho-associated protein kinase 1
Ligand
BDBM299190
Substrate
Meas. Tech.
Rho-kinase inhibition assay for ROC2 and ROCK1
IC50
>10000±n/a nM
Citation
 Kim, JLiu, KPoyurovsky, MLu, DZhu, Z Rho kinase inhibitors US Patent  US10125144 Publication Date 11/13/2018 
Target
Name:
Rho-associated protein kinase 1
Synonyms:
ROCK-I ROCK1_HUMAN Rho-associated protein kinase Rho-associated, coiled-coil-containing protein kinase 1 Rho-kinase (ROCK I) p160 ROCK-1 | p160ROCK
Type:
Serine/threonine-protein kinase
Mol. Mass.:
158156.77
Organism:
Homo sapiens (Human)
Description:
Q13464
Residue:
1354
  
Inhibitor
Name:
BDBM299190
Synonyms:
N-(4-(1H-pyrazol-4-yl)phenyl)-2-(5-methoxyisoindolin-2-yl)pyrimidin-4-amine US11311541, Example 198
Type:
Small organic molecule
Emp. Form.:
C22H20N6O
Mol. Mass.:
384.4338
SMILES:
COc1ccc2CN(Cc2c1)c1nccc(Nc2ccc(cc2)-c2cn[nH]c2)n1
: