Target
Glycogen synthase kinase-3 beta
Ligand
BDBM7329
Substrate
GSK-3 Peptide Substrate
Meas. Tech.
Kinase Inhibition Assay
Temperature
303.15±n/a K
IC50
70±n/a nM
Comments
extracted
Citation
 Kunick, CLauenroth, KWieking, KXie, XSchultz, CGussio, RZaharevitz, DLeost, MMeijer, LWeber, AJorgensen, FSLemcke, T Evaluation and comparison of 3D-QSAR CoMSIA models for CDK1, CDK5, and GSK-3 inhibition by paullones. J Med Chem 47:22-36 (2004)  
Target
Name:
Glycogen synthase kinase-3 beta
Synonyms:
GSK-3, beta Glycogen Synthase Kinase-3, beta | Gsk3b
Type:
Enzyme
Mol. Mass.:
46754.43
Organism:
Rattus norvegicus (rat)
Description:
The rat GSK-3 beta cDNA was inserted into the baculovirus vector. The protein was purified from virus-infected sf9 insect cells
Residue:
420
  
Inhibitor
Name:
BDBM7329
Synonyms:
3-Methoxy-9-nitro-7,12-dihydro-indolo[3,2-d][1]benzazepin-6(5H)-one NSC 720309 | Paullone Analogue 64
Type:
Small organic molecule
Emp. Form.:
C17H13N3O4
Mol. Mass.:
323.3028
SMILES:
COc1ccc2-c3[nH]c4ccc(cc4c3CC(=O)Nc2c1)[N+]([O-])=O
:
Substrate
Name:
GSK-3 Peptide Substrate
Synonyms:
GS-1 Peptide | Phospho-GS2 Substrate Peptide
Type:
Peptide
Mol. Mass.:
3045.17
Organism:
Description:
Residue:
27