Target
Plasma kallikrein
Ligand
BDBM455195
Substrate
Meas. Tech.
Inhibitory Activity of Exemplary Compounds against Plasma Kallikrein
EC50
<1.0±n/a nM
Citation
 Papaioannou, NFink, SJMiller, TAShipps, Jr., GWTravins, JMEhmann, DERae, AEllard, JM Inhibitors of plasma kallikrein and uses thereof US Patent  US10730874 Publication Date 8/4/2020 
Target
Name:
Plasma kallikrein
Synonyms:
Fletcher factor KLKB1 Kallikrein Plasma kallikrein heavy chain Plasma prekallikrein
Type:
Protein
Mol. Mass.:
71391.16
Organism:
Homo sapiens (Human)
Description:
P03952
Residue:
638
  
Inhibitor
Name:
BDBM455195
Synonyms:
US10730874, Compound I-212
Type:
Small organic molecule
Emp. Form.:
C26H24ClFN8O4
Mol. Mass.:
566.971
SMILES:
CC(C)(Oc1cc(cn2cc(Cn3cc(nn3)C(=O)NCc3ncn4ccc(Cl)c(F)c34)nc12)C1CC1)C(O)=O
: