Target
Plasma kallikrein
Ligand
BDBM455266
Substrate
Meas. Tech.
Inhibitory Activity of Exemplary Compounds against Plasma Kallikrein
EC50
<1.0±n/a nM
Citation
 Papaioannou, NFink, SJMiller, TAShipps, Jr., GWTravins, JMEhmann, DERae, AEllard, JM Inhibitors of plasma kallikrein and uses thereof US Patent  US10730874 Publication Date 8/4/2020 
Target
Name:
Plasma kallikrein
Synonyms:
Fletcher factor KLKB1 Kallikrein Plasma kallikrein heavy chain Plasma prekallikrein
Type:
Protein
Mol. Mass.:
71391.16
Organism:
Homo sapiens (Human)
Description:
P03952
Residue:
638
  
Inhibitor
Name:
BDBM455266
Synonyms:
BDBM455275 | US10730874, Compound I-274
Type:
Small organic molecule
Emp. Form.:
C24H19ClFN7O3
Mol. Mass.:
507.904
SMILES:
OC(=O)c1c(Cn2cc(nn2)C(=O)NCc2ncn3ccc(Cl)c(F)c23)[nH]c2cc(ccc12)C1CC1
: