Target
Amyloid-beta precursor protein
Ligand
BDBM455351
Substrate
Meas. Tech.
Cellular gamma-Secretase Assay
EC50
111±n/a nM
Citation
 Bartels, BJakob-Roetne, RLimberg, ANeidhart, WRatni, HReutlinger, MSteiner, S Fused pyrimidine derivatives US Patent  US10730881 Publication Date 8/4/2020 
Target
Name:
Amyloid-beta precursor protein
Synonyms:
A4 ABPP AICD-50 AICD-59 AID(57) APP Alzheimer disease amyloid protein Amyloid beta Protein Amyloid beta protein Abeta(1-42) Amyloid intracellular domain 57 Amyloid protein (Abeta42b) Beta amyloid A4 protein Beta-APP42 Beta-amyloid protein 42 C83 CVAP Gamma Secretase Gamma-CTF(57) Gamma-secretase Gamma-secretase C-terminal fragment 57 P3(40) PN-II Protease nexin-II S-APP-beta Soluble APP-beta | beta-Amyloid Precursor Protein (APP)
Type:
Single-pass type I membrane protein
Mol. Mass.:
86890.41
Organism:
Homo sapiens (Human)
Description:
P05067
Residue:
770
  
Inhibitor
Name:
BDBM455351
Synonyms:
N4,5,5-Trimethyl-N2-((1R,5S,8s)-3-(6-methylpyrimidin-4-yl)-3-azabicyclo[3.2.1]octan-8-yl)-7-(3-(trifluoromethyl)bicyclo[1.1.1]pentan-1-yl)-6,7-dihydro-5H-pyrrolo[2,3-d]pyrimidine-2,4-diamine | US10730881, Example 17
Type:
Small organic molecule
Emp. Form.:
C27H35F3N8
Mol. Mass.:
528.6156
SMILES:
CNc1nc(NC2C3CCC2CN(C3)c2cc(C)ncn2)nc2N(CC(C)(C)c12)C12CC(C1)(C2)C(F)(F)F
: