Target
Apelin receptor
Ligand
BDBM456670
Substrate
Meas. Tech.
GTPγS Binding
EC50
0.061±n/a nM
Citation
 Brown, MChen, NChen, XChen, YCheng, ACConnors, RVDeignan, JDransfield, PJDu, XFu, ZHarvey, JSHeath, JAHeumann, LVHouze, JKayser, FKhakoo, AYKopecky, DLai, SMa, ZMedina, JCMihalic, JTOlson, SHPattaropong, VSwaminath, GWang, XWanska, MYeh, W Triazole furan compounds as agonists of the APJ receptor US Patent  US10736883 Publication Date 8/11/2020 
Target
Name:
Apelin receptor
Synonyms:
AGTRL1 APJ_HUMAN Angiotensin receptor-like 1 Apelin receptor (APJ) G-protein coupled receptor HG11
Type:
Enzyme Catalytic Domain
Mol. Mass.:
42664.06
Organism:
Homo sapiens (Human)
Description:
P35414
Residue:
380
  
Inhibitor
Name:
BDBM456670
Synonyms:
US10736883, Example 117.0
Type:
Small organic molecule
Emp. Form.:
C25H30N6O6S
Mol. Mass.:
542.607
SMILES:
CCO[C@H]([C@H](C)S(=O)(=O)Nc1nnc(-c2ccc(C)o2)n1-c1c(OC)cccc1OC)c1ncc(C)cn1
: