Target
P2X purinoceptor 3
Ligand
BDBM183251
Substrate
Meas. Tech.
P2X3 Inhibition Assay
IC50
6.00±n/a nM
Citation
 PubChem, PCKai, HKameyama, THasegawa, TOohara, MTada, YEndoh, T Triazine derivative and pharmaceutical composition comprising the same US Patent  US9688643 Publication Date 6/27/2017 
Target
Name:
P2X purinoceptor 3
Synonyms:
ATP receptor P2RX3 P2X purinoceptor 3 P2X purinoceptor 3 (P2X3) P2X3 purinoceptor p2x3 + hsa
Type:
Protein
Mol. Mass.:
44292.02
Organism:
Homo sapiens (Human)
Description:
P56373
Residue:
397
  
Inhibitor
Name:
BDBM183251
Synonyms:
US9150546, I-422 US9718790, I-0421
Type:
Small organic molecule
Emp. Form.:
C26H28ClFN4O5
Mol. Mass.:
530.976
SMILES:
CCOC(=O)C1(Cn2c(=O)[nH]\c(=N/c3ccc(OC(C)C)c(F)c3)n(Cc3ccc(Cl)cc3)c2=O)CC1
: