Target
P2X purinoceptor 3
Ligand
BDBM183289
Substrate
Meas. Tech.
P2X3 Inhibition Assay
IC50
4.00±n/a nM
Citation
 PubChem, PCKai, HKameyama, THasegawa, TOohara, MTada, YEndoh, T Triazine derivative and pharmaceutical composition comprising the same US Patent  US9688643 Publication Date 6/27/2017 
Target
Name:
P2X purinoceptor 3
Synonyms:
ATP receptor P2RX3 P2X purinoceptor 3 P2X purinoceptor 3 (P2X3) P2X3 purinoceptor p2x3 + hsa
Type:
Protein
Mol. Mass.:
44292.02
Organism:
Homo sapiens (Human)
Description:
P56373
Residue:
397
  
Inhibitor
Name:
BDBM183289
Synonyms:
US9150546, I-458 US9718790, I-0467
Type:
Small organic molecule
Emp. Form.:
C24H26Cl2N4O5
Mol. Mass.:
521.393
SMILES:
COC(=O)[C@@H](C)Cn1c(=O)[nH]\c(=N/c2ccc(OC(C)C)c(Cl)c2)n(Cc2ccc(Cl)cc2)c1=O
: