Target
Tyrosine-protein kinase JAK1
Ligand
BDBM246873
Substrate
Meas. Tech.
In Vitro JAK Kinase Assay
IC50
<10±n/a nM
Citation
 Li, YMetcalf, BWLi, H Crystalline forms of a PI3K inhibitor US Patent  US10125150 Publication Date 11/13/2018 
Target
Name:
Tyrosine-protein kinase JAK1
Synonyms:
JAK-1 JAK1A JAK1_HUMAN Janus kinase 1 (JAK1) | Janus kinase 1 JAK1
Type:
Protein
Mol. Mass.:
133293.73
Organism:
Homo sapiens (Human)
Description:
P23458
Residue:
1154
  
Inhibitor
Name:
BDBM246873
Synonyms:
US10053465, 12 US10125150, Example 12 US10479803, Example 12 US10675284, Example 12 US11130767, # 12 US11304949, Compound 12 US11406640, Comp. No. 12 US9732097, Example 12 | {trans-3-(4-{[4- {[(2S)-2- (hydroxymethyl) pyrrolidin-1-yl] methyl}-6- (trifluoromethyl) pyridin-2- yl]oxy}piperidin-1- yl)-1-[4-(7H- pyrrolo[2,3- d]pyrimidin-4-yl)- 1H-pyrazol-1- yl]cyclobutyl} acetonitrile
Type:
Small organic molecule
Emp. Form.:
C32H36F3N9O2
Mol. Mass.:
635.6825
SMILES:
OC[C@@H]1CCCN1Cc1cc(OC2CCN(CC2)[C@H]2C[C@@](CC#N)(C2)n2cc(cn2)-c2ncnc3[nH]ccc23)nc(c1)C(F)(F)F
: