Target
Retinoic acid receptor beta
Ligand
BDBM458233
Substrate
Meas. Tech.
Transactivation assays
EC50
2.00±n/a nM
Citation
 Borthwick, ADMills, MTBrown, JTCorcoran, JPDe Castro Vasconcelos Goncalves, MBKalindjian, SB Bicycloheteroaryl-heteroaryl-benzoic acid compounds as retinoic acid receptor beta (RARβ) agonists US Patent  US10752616 Publication Date 8/25/2020 
Target
Name:
Retinoic acid receptor beta
Synonyms:
HAP NR1B2 RAR-beta RARB Retinoic acid receptor RXR-alpha/Retinoic acid receptor beta Retinoid receptor
Type:
PROTEIN
Mol. Mass.:
50498.70
Organism:
Homo sapiens (Human)
Description:
ChEMBL_1458015
Residue:
455
  
Inhibitor
Name:
BDBM458233
Synonyms:
US10752616, Code No. BHBA-014
Type:
Small organic molecule
Emp. Form.:
C17H7Cl2FN2O4
Mol. Mass.:
393.153
SMILES:
OC(=O)c1ccc(cc1F)-c1noc(n1)-c1cc2c(Cl)ccc(Cl)c2o1
: