Target
Retinoic acid receptor beta
Ligand
BDBM458287
Substrate
Meas. Tech.
Transactivation assays
EC50
4.00±n/a nM
Citation
 Borthwick, ADMills, MTBrown, JTCorcoran, JPDe Castro Vasconcelos Goncalves, MBKalindjian, SB Bicycloheteroaryl-heteroaryl-benzoic acid compounds as retinoic acid receptor beta (RARβ) agonists US Patent  US10752616 Publication Date 8/25/2020 
Target
Name:
Retinoic acid receptor beta
Synonyms:
HAP NR1B2 RAR-beta RARB Retinoic acid receptor RXR-alpha/Retinoic acid receptor beta Retinoid receptor
Type:
PROTEIN
Mol. Mass.:
50498.70
Organism:
Homo sapiens (Human)
Description:
ChEMBL_1458015
Residue:
455
  
Inhibitor
Name:
BDBM458287
Synonyms:
US10752616, Code No. BHBA-045
Type:
Small organic molecule
Emp. Form.:
C19H13ClN2O4
Mol. Mass.:
368.771
SMILES:
Cc1cc(Cl)c(C)c2cc(oc12)-c1nc(no1)-c1ccc(cc1)C(O)=O
: