Target
cAMP and cAMP-inhibited cGMP 3',5'-cyclic phosphodiesterase 10A
Ligand
BDBM156255
Substrate
Meas. Tech.
Inhibition Assay
IC50
5.40±n/a nM
Citation
 Ritzen, ALanggard, MKehler, JNielsen, JKilburn, JPFarah, MM Substituted imidazoles as PDE10A inhibitors US Patent  US9592230 Publication Date 3/14/2017 
Target
Name:
cAMP and cAMP-inhibited cGMP 3',5'-cyclic phosphodiesterase 10A
Synonyms:
3',5'-cyclic phosphodiesterase PDE10_HUMAN Phosphodiesterase 10A
Type:
Protein
Mol. Mass.:
88412.52
Organism:
Homo sapiens (Human)
Description:
Q9Y233
Residue:
779
  
Inhibitor
Name:
BDBM156255
Synonyms:
US9018217, 5,7-Dimethyl-2-[1-(3-methyl-butyl)-4-phenyl-1H-imidazol-2-ylsulfanylmethyl]-imidazo[1,2-a]pyrimidine | US9592230, 5,7-Dimethyl-2-[1-(3-methyl-butyl)-4-phenyl-1H-imidazol-2-ylsulfanylmethyl]-imidazo[1,2-a]pyrimidine
Type:
Small organic molecule
Emp. Form.:
C23H27N5S
Mol. Mass.:
405.559
SMILES:
CC(C)CCn1cc(nc1SCc1cn2c(C)cc(C)nc2n1)-c1ccccc1
: