Target
cAMP and cAMP-inhibited cGMP 3',5'-cyclic phosphodiesterase 10A
Ligand
BDBM156263
Substrate
Meas. Tech.
Inhibition Assay
IC50
52±n/a nM
Citation
 Ritzen, ALanggard, MKehler, JNielsen, JKilburn, JPFarah, MM Substituted imidazoles as PDE10A inhibitors US Patent  US9592230 Publication Date 3/14/2017 
Target
Name:
cAMP and cAMP-inhibited cGMP 3',5'-cyclic phosphodiesterase 10A
Synonyms:
3',5'-cyclic phosphodiesterase PDE10_HUMAN Phosphodiesterase 10A
Type:
Protein
Mol. Mass.:
88412.52
Organism:
Homo sapiens (Human)
Description:
Q9Y233
Residue:
779
  
Inhibitor
Name:
BDBM156263
Synonyms:
US9018217, [2-(5,7-Dimethyl-imidazo[1,2-a]pyrimidin-2-ylmethylsulfanyl)-4-phenyl-imidazol-1-yl]-acetonitrile | US9592230, [2-(5,7-Dimethyl-imidazo[1,2-a]pyrimidin-2-ylmethylsulfanyl)-4-phenyl-imidazol-1-yl]-acetonitrile
Type:
Small organic molecule
Emp. Form.:
C20H18N6S
Mol. Mass.:
374.462
SMILES:
Cc1cc(C)n2cc(CSc3nc(cn3CC#N)-c3ccccc3)nc2n1
: