Target
cAMP and cAMP-inhibited cGMP 3',5'-cyclic phosphodiesterase 10A
Ligand
BDBM156295
Substrate
Meas. Tech.
Inhibition Assay
IC50
360±n/a nM
Citation
 Ritzen, ALanggard, MKehler, JNielsen, JKilburn, JPFarah, MM Substituted imidazoles as PDE10A inhibitors US Patent  US9592230 Publication Date 3/14/2017 
Target
Name:
cAMP and cAMP-inhibited cGMP 3',5'-cyclic phosphodiesterase 10A
Synonyms:
3',5'-cyclic phosphodiesterase PDE10_HUMAN Phosphodiesterase 10A
Type:
Protein
Mol. Mass.:
88412.52
Organism:
Homo sapiens (Human)
Description:
Q9Y233
Residue:
779
  
Inhibitor
Name:
BDBM156295
Synonyms:
US9018217, 2-(1-Methyl-4-phenyl-1H-imidazol-2-ylsulfanylmethyl)-imidazo[1,2-a]pyridine-7-carbonitrile | US9592230, 2-(1-Methyl-4-phenyl-1H-imidazol-2-ylsulfanylmethyl)-imidazo[1,2-a]pyridine-7-carbonitrile
Type:
Small organic molecule
Emp. Form.:
C19H15N5S
Mol. Mass.:
345.421
SMILES:
Cn1cc(nc1SCc1cn2ccc(cc2n1)C#N)-c1ccccc1
: