Target
cAMP and cAMP-inhibited cGMP 3',5'-cyclic phosphodiesterase 10A
Ligand
BDBM156322
Substrate
Meas. Tech.
Inhibition Assay
IC50
8.10±n/a nM
Citation
 Ritzen, ALanggard, MKehler, JNielsen, JKilburn, JPFarah, MM Substituted imidazoles as PDE10A inhibitors US Patent  US9592230 Publication Date 3/14/2017 
Target
Name:
cAMP and cAMP-inhibited cGMP 3',5'-cyclic phosphodiesterase 10A
Synonyms:
3',5'-cyclic phosphodiesterase PDE10_HUMAN Phosphodiesterase 10A
Type:
Protein
Mol. Mass.:
88412.52
Organism:
Homo sapiens (Human)
Description:
Q9Y233
Residue:
779
  
Inhibitor
Name:
BDBM156322
Synonyms:
US9018217, 5-Methyl-2-{2-[1-(2-morpholin-4-yl-ethyl)-4-phenyl-1H-imidazol-2-yl]-ethyl}-[1,2,4]triazolo[1,5-a]pyridine | US9592230, 5-Methyl-2-{2-[1-(2-morpholin-4-yl-ethyl)-4-phenyl-1H-imidazol-2-yl]-ethyl}-[1,2,4]triazolo[1,5-a]pyridine
Type:
Small organic molecule
Emp. Form.:
C24H28N6O
Mol. Mass.:
416.5187
SMILES:
Cc1cccc2nc(CCc3nc(cn3CCN3CCOCC3)-c3ccccc3)nn12
: