Target
cAMP and cAMP-inhibited cGMP 3',5'-cyclic phosphodiesterase 10A
Ligand
BDBM156332
Substrate
Meas. Tech.
Inhibition Assay
IC50
25±n/a nM
Citation
 Ritzen, ALanggard, MKehler, JNielsen, JKilburn, JPFarah, MM Substituted imidazoles as PDE10A inhibitors US Patent  US9592230 Publication Date 3/14/2017 
Target
Name:
cAMP and cAMP-inhibited cGMP 3',5'-cyclic phosphodiesterase 10A
Synonyms:
3',5'-cyclic phosphodiesterase PDE10_HUMAN Phosphodiesterase 10A
Type:
Protein
Mol. Mass.:
88412.52
Organism:
Homo sapiens (Human)
Description:
Q9Y233
Residue:
779
  
Inhibitor
Name:
BDBM156332
Synonyms:
US9018217, 5,7-Dimethyl-2-(1-methyl-4-phenyl-1H-imidazol-2-ylsulfanylmethyl)-[1,2,4]triazolo[1,5-a]pyrimidine | US9592230, 5,7-Dimethyl-2-(1-methyl-4-phenyl-1H-imidazol-2-ylsulfanylmethyl)-[1,2,4]triazolo[1,5-a]pyrimidine
Type:
Small organic molecule
Emp. Form.:
C18H18N6S
Mol. Mass.:
350.441
SMILES:
Cc1cc(C)n2nc(CSc3nc(cn3C)-c3ccccc3)nc2n1
: