Target
Glucocorticoid receptor
Ligand
BDBM50048331
Substrate
Meas. Tech.
Receptor Binding Assay
Ki
12.9±n/a nM
Citation
 Weinstein, DSGong, HYang, MGXiao, Z Imide and acylurea derivatives as modulators of the glucocorticoid receptor US Patent  US9593113 Publication Date 3/14/2017 
Target
Name:
Glucocorticoid receptor
Synonyms:
GCR_HUMAN GRL Glucocorticoid receptor (GRFP) Nuclear receptor subfamily 3 group C member 1
Type:
Enzyme
Mol. Mass.:
85656.87
Organism:
Homo sapiens (Human)
Description:
P04150
Residue:
777
  
Inhibitor
Name:
BDBM50048331
Synonyms:
CHEMBL3315053 | US9593113, Example 6
Type:
Small organic molecule
Emp. Form.:
C31H32FN3O5
Mol. Mass.:
545.6013
SMILES:
CC(C)C(=O)NC(=O)C(C)(C)[C@@H]1c2ccc(nc2Oc2c(F)cccc12)-c1ccc(cc1)C(=O)N1CCOCC1
: