Target
Glucocorticoid receptor
Ligand
BDBM299246
Substrate
Meas. Tech.
Receptor Binding Assay
Ki
5.04±n/a nM
Citation
 Weinstein, DSGong, HYang, MGXiao, Z Imide and acylurea derivatives as modulators of the glucocorticoid receptor US Patent  US9593113 Publication Date 3/14/2017 
Target
Name:
Glucocorticoid receptor
Synonyms:
GCR_HUMAN GRL Glucocorticoid receptor (GRFP) Nuclear receptor subfamily 3 group C member 1
Type:
Enzyme
Mol. Mass.:
85656.87
Organism:
Homo sapiens (Human)
Description:
P04150
Residue:
777
  
Inhibitor
Name:
BDBM299246
Synonyms:
US9593113, Example 12
Type:
Small organic molecule
Emp. Form.:
C26H26FN3O5S
Mol. Mass.:
511.565
SMILES:
CCS(=O)(=O)c1ccc(cc1)-c1ccc2[C@H](c3cccc(F)c3Oc2n1)C(C)(C)C(=O)NC(=O)NC
: