Target
Glucocorticoid receptor
Ligand
BDBM299260
Substrate
Meas. Tech.
Receptor Binding Assay
Ki
5.26±n/a nM
Citation
 Weinstein, DSGong, HYang, MGXiao, Z Imide and acylurea derivatives as modulators of the glucocorticoid receptor US Patent  US9593113 Publication Date 3/14/2017 
Target
Name:
Glucocorticoid receptor
Synonyms:
GCR_HUMAN GRL Glucocorticoid receptor (GRFP) Nuclear receptor subfamily 3 group C member 1
Type:
Enzyme
Mol. Mass.:
85656.87
Organism:
Homo sapiens (Human)
Description:
P04150
Residue:
777
  
Inhibitor
Name:
BDBM299260
Synonyms:
US9593113, Example 25
Type:
Small organic molecule
Emp. Form.:
C27H28FN3O5S
Mol. Mass.:
525.592
SMILES:
CNC(=O)NC(=O)C(C)(C)[C@@H]1c2ccc(nc2Oc2c(F)cccc12)-c1ccc(cc1)S(=O)(=O)C(C)C
: