Target
Glucocorticoid receptor
Ligand
BDBM299287
Substrate
Meas. Tech.
Receptor Binding Assay
Ki
1.34±n/a nM
Citation
 Weinstein, DSGong, HYang, MGXiao, Z Imide and acylurea derivatives as modulators of the glucocorticoid receptor US Patent  US9593113 Publication Date 3/14/2017 
Target
Name:
Glucocorticoid receptor
Synonyms:
GCR_HUMAN GRL Glucocorticoid receptor (GRFP) Nuclear receptor subfamily 3 group C member 1
Type:
Enzyme
Mol. Mass.:
85656.87
Organism:
Homo sapiens (Human)
Description:
P04150
Residue:
777
  
Inhibitor
Name:
BDBM299287
Synonyms:
US9593113, Example 51
Type:
Small organic molecule
Emp. Form.:
C28H27FN4O4
Mol. Mass.:
502.5368
SMILES:
CC(C)([C@H]1c2ccccc2Oc2nc(ccc12)-c1ccc(C(=O)N2CCCC2)c(F)c1)C(=O)NC(N)=O
: