Target
Glucocorticoid receptor
Ligand
BDBM299296
Substrate
Meas. Tech.
Receptor Binding Assay
Ki
1.13±n/a nM
Citation
 Weinstein, DSGong, HYang, MGXiao, Z Imide and acylurea derivatives as modulators of the glucocorticoid receptor US Patent  US9593113 Publication Date 3/14/2017 
Target
Name:
Glucocorticoid receptor
Synonyms:
GCR_HUMAN GRL Glucocorticoid receptor (GRFP) Nuclear receptor subfamily 3 group C member 1
Type:
Enzyme
Mol. Mass.:
85656.87
Organism:
Homo sapiens (Human)
Description:
P04150
Residue:
777
  
Inhibitor
Name:
BDBM299296
Synonyms:
US9593113, Example 60
Type:
Small organic molecule
Emp. Form.:
C25H26FN5O3
Mol. Mass.:
463.504
SMILES:
CC(C)Nc1ccc(cn1)-c1ccc2[C@H](c3cccc(F)c3Oc2n1)C(C)(C)C(=O)NC(N)=O
: