Target
Glucocorticoid receptor
Ligand
BDBM299321
Substrate
Meas. Tech.
Receptor Binding Assay
Ki
1.20±n/a nM
Citation
 Weinstein, DSGong, HYang, MGXiao, Z Imide and acylurea derivatives as modulators of the glucocorticoid receptor US Patent  US9593113 Publication Date 3/14/2017 
Target
Name:
Glucocorticoid receptor
Synonyms:
GCR_HUMAN GRL Glucocorticoid receptor (GRFP) Nuclear receptor subfamily 3 group C member 1
Type:
Enzyme
Mol. Mass.:
85656.87
Organism:
Homo sapiens (Human)
Description:
P04150
Residue:
777
  
Inhibitor
Name:
BDBM299321
Synonyms:
US9593113, Example 85
Type:
Small organic molecule
Emp. Form.:
C28H26F2N4O4
Mol. Mass.:
520.5272
SMILES:
CC(C)([C@@H]1c2ccc(nc2Oc2c(F)cccc12)-c1ccc(cc1)C(=O)N1CC[C@@H](F)C1)C(=O)NC(N)=O
: