Target
Glycogen synthase kinase-3 beta
Ligand
BDBM459192
Substrate
Meas. Tech.
Kinase Assay
EC50
1.000±n/a nM
Citation
 K C, SKMittapalli, GKChiruta, CHofilena, BJ Indazole containing macrocycles and therapeutic uses thereof US Patent  US10759799 Publication Date 9/1/2020 
Target
Name:
Glycogen synthase kinase-3 beta
Synonyms:
GSK-3 beta GSK3B Glycogen synthase kinase 3 beta (GSK3B) Glycogen synthase kinase-3 beta (GSK-3B) Glycogen synthase kinase-3 beta (GSK3B) Glycogen synthase kinase-3beta (GSK3B) | Serine/threonine-protein kinase GSK3B
Type:
Enzyme
Mol. Mass.:
46756.38
Organism:
Homo sapiens (Human)
Description:
P49841
Residue:
420
  
Inhibitor
Name:
BDBM459192
Synonyms:
US10759799, Compound 38
Type:
Small organic molecule
Emp. Form.:
C26H17N7O2
Mol. Mass.:
459.4589
SMILES:
O=C1COc2cccc(c2)-c2cncc3[nH]c(nc23)-c2n[nH]c3ccc(cc23)-c2cncc(N1)c2
: