Target
E3 ubiquitin-protein ligase Mdm2 [1-188]
Ligand
BDBM215390
Substrate
Meas. Tech.
Homogenous Time-Resolved Fluorescence Assay (HTRF2 Assay)
IC50
0.100±n/a nM
Target
Name:
E3 ubiquitin-protein ligase Mdm2 [1-188]
Synonyms:
E3 ubiquitin-protein ligase Mdm2 (aa 1-188) MDM2_HUMAN
Type:
Mol. Mass.:
21319.18
Organism:
Homo sapiens (Human)
Description:
Q00987[1-188]
Residue:
188
  
Inhibitor
Name:
BDBM215390
Synonyms:
US9296736, 371 | US9593129, Example 371
Type:
Small organic molecule
Emp. Form.:
C27H33Cl2NO5S
Mol. Mass.:
554.526
SMILES:
CC[C@@H]([C@H](C)S(=O)(=O)CC)N1[C@@H]([C@H](C[C@](C)(CC(O)=O)C1=O)c1cccc(Cl)c1)c1ccc(Cl)cc1
: