Target
Envelope glycoprotein gp160
Ligand
BDBM461126
Substrate
Meas. Tech.
MT-4 HIV High Resolution Antiviral Assay
EC50
8.57±n/a nM
Citation
 Cai, ZRCho, AGonzalez Buenrostro, AZHan, XJabri, SYMcFadden, RQi, YVoigt, JYang, HXu, JXu, L HIV protease inhibitors US Patent  US10774053 Publication Date 9/15/2020 
Target
Name:
Envelope glycoprotein gp160
Synonyms:
ENV_HV1H2 Envelope surface glycoprotein gp160, precursor env
Type:
Mol. Mass.:
97241.93
Organism:
Human immunodeficiency virus type 1 group M subtype B (isolate HXB2)
Description:
Residue:
856
  
Inhibitor
Name:
BDBM461126
Synonyms:
US10774053, Compound 296 | US11352329, COMPD # 296
Type:
Small organic molecule
Emp. Form.:
C33H34ClF4N9O3
Mol. Mass.:
716.128
SMILES:
Cn1ccc(n1)-c1ccc(cc1)[C@@]1(CC(C)(C)C)NC(=N)N([C@H](COC(=O)N[C@H]2CC2(F)F)c2ccc(Cl)c(c2)-n2ncnc2C(F)F)C1=O
: