Target
Mitogen-activated protein kinase kinase kinase kinase 4
Ligand
BDBM299435
Substrate
Meas. Tech.
MAP4K4 Inhibition Assay
IC50
263±n/a nM
Citation
 Chen, HCrawford, THarris, SFMagnuson, SRNdubaku, CWang, L Aminoquinazoline and pyridopyrimidine derivatives US Patent  US9592235 Publication Date 3/14/2017 
Target
Name:
Mitogen-activated protein kinase kinase kinase kinase 4
Synonyms:
HGK KIAA0687 MAP4K4 MAPK/ERK kinase kinase kinase 4 MEKKK 4 NIK | Nck-interacting kinase
Type:
Serine/threonine-protein kinase
Mol. Mass.:
142114.73
Organism:
Homo sapiens (Human)
Description:
O95819
Residue:
1239
  
Inhibitor
Name:
BDBM299435
Synonyms:
N-[3-(4-amino- quinazolin-6-yl) phenyl]-2- (dimethylamino) acetamide US9855269, Compound 71
Type:
Small organic molecule
Emp. Form.:
C18H19N5O
Mol. Mass.:
321.3764
SMILES:
CN(C)CC(=O)Nc1cccc(c1)-c1ccc2ncnc(N)c2c1
: