Target
Mitogen-activated protein kinase kinase kinase kinase 4
Ligand
BDBM299545
Substrate
Meas. Tech.
MAP4K4 Inhibition Assay
IC50
232±n/a nM
Citation
 Chen, HCrawford, THarris, SFMagnuson, SRNdubaku, CWang, L Aminoquinazoline and pyridopyrimidine derivatives US Patent  US9592235 Publication Date 3/14/2017 
Target
Name:
Mitogen-activated protein kinase kinase kinase kinase 4
Synonyms:
HGK KIAA0687 MAP4K4 MAPK/ERK kinase kinase kinase 4 MEKKK 4 NIK | Nck-interacting kinase
Type:
Serine/threonine-protein kinase
Mol. Mass.:
142114.73
Organism:
Homo sapiens (Human)
Description:
O95819
Residue:
1239
  
Inhibitor
Name:
BDBM299545
Synonyms:
N-[6-(3-amino-5- fluoro-phenyl) pyrido[3,2-d] pyrimidin-4-yl]- 2-pyrrolidin-1-yl- acetamide US9855269, Compound 164
Type:
Small organic molecule
Emp. Form.:
C19H19FN6O
Mol. Mass.:
366.3922
SMILES:
Nc1cc(F)cc(c1)-c1ccc2ncnc(NC(=O)CN3CCCC3)c2n1
: