Target
Mitogen-activated protein kinase kinase kinase kinase 4
Ligand
BDBM299569
Substrate
Meas. Tech.
MAP4K4 Inhibition Assay
IC50
2900±n/a nM
Citation
 Chen, HCrawford, THarris, SFMagnuson, SRNdubaku, CWang, L Aminoquinazoline and pyridopyrimidine derivatives US Patent  US9592235 Publication Date 3/14/2017 
Target
Name:
Mitogen-activated protein kinase kinase kinase kinase 4
Synonyms:
HGK KIAA0687 MAP4K4 MAPK/ERK kinase kinase kinase 4 MEKKK 4 NIK | Nck-interacting kinase
Type:
Serine/threonine-protein kinase
Mol. Mass.:
142114.73
Organism:
Homo sapiens (Human)
Description:
O95819
Residue:
1239
  
Inhibitor
Name:
BDBM299569
Synonyms:
6-(4-pyridyloxy) pyrido[3,2-d] pyrimidin-4- amine US9855269, Compound 235
Type:
Small organic molecule
Emp. Form.:
C12H9N5O
Mol. Mass.:
239.2328
SMILES:
Nc1ncnc2ccc(Oc3ccncc3)nc12
: