Target
Cyclin-dependent kinase 4/G1/S-specific cyclin-D1
Ligand
BDBM462171
Substrate
Meas. Tech.
Biological Assay
Ki
0.500±n/a nM
Citation
 Chen, PCho-Schultz, SDeal, JGGallego, GMJalaie, MKania, RSNair, SKNinkovic, SOrr, STPalmer, CL Cyclin dependent kinase inhibitors US Patent  US10766884 Publication Date 9/8/2020 
Target
Name:
Cyclin-dependent kinase 4/G1/S-specific cyclin-D1
Synonyms:
CDK4/CycD CDK4/Cyclin D1 Cyclin-Dependent Kinase 4 (CDK4) Cyclin-dependent kinase 4/G1/S-specific cyclin D1 | Cyclin-dependent kinase 4/cyclin D1
Type:
Protein Complex
Mol. Mass.:
Description:
CDK4/D1 complexes were purified from insect cells co-infected with baculovirus vectors containing each of the components.
Components:
This complex has 2 components.
Component 1
Name:
Cyclin-dependent kinase 4
Synonyms:
CDK4 Cell division protein kinase 4 PSK-J3
Type:
Enzyme Subunit
Mol. Mass.:
33731.96
Organism:
Homo sapiens (Human)
Description:
P11802
Residue:
303
  
Component 2
Name:
G1/S-specific cyclin-D1
Synonyms:
B-cell lymphoma 1 protein BCL-1 oncogene CCND1 PRAD1 | PRAD1 oncogene
Type:
Enzyme Subunit
Mol. Mass.:
33717.70
Organism:
Homo sapiens (Human)
Description:
Residue:
295
  
Inhibitor
Name:
BDBM462171
Synonyms:
(Scheme A-11): Preparation of (3R,4R)-4-({5-chloro-4-[4-fluoro-2-(hydroxymethyl)-1-(2,2,2-trifluoroethyl)-1H-benzimidazol-6-yl]pyrimidin-2-yl}amino)-1-(methanesulfonyl)piperidin-3-ol US11220494, Example A89
Type:
Small organic molecule
Emp. Form.:
C21H24ClFN6O4S
Mol. Mass.:
510.969
SMILES:
Cc1nc2c(F)cc(cc2n1C1COC1)-c1nc(N[C@@H]2CCN(C[C@H]2O)S(C)(=O)=O)ncc1Cl
: