Target
P2X purinoceptor 7
Ligand
BDBM242138
Substrate
Meas. Tech.
Binding Assay
IC50
3.60±n/a nM
Citation
 Kilburn, JPRasmussen, LKJessing, MEldemenky, EMChen, BJiang, Y Cyclic amines US Patent  US9593105 Publication Date 3/14/2017 
Target
Name:
P2X purinoceptor 7
Synonyms:
ATP receptor P2RX7_HUMAN P2X purinoceptor 7 (P2X7) P2Z receptor | Purinergic receptor
Type:
Protein
Mol. Mass.:
68602.85
Organism:
Homo sapiens (Human)
Description:
Q99572
Residue:
595
  
Inhibitor
Name:
BDBM242138
Synonyms:
US9415055, (-)2-chloro-N-[2-(4,4-difluoro-1-piperidyl)-2-[2-(trifluoromethyl)pyrimidin-5-yl]ethyl]-3-methoxy-benzamide | US9593105, 140
Type:
Small organic molecule
Emp. Form.:
C20H20ClF5N4O2
Mol. Mass.:
478.843
SMILES:
COc1cccc(C(=O)NCC(N2CCC(F)(F)CC2)c2cnc(nc2)C(F)(F)F)c1Cl
: