Target
P2X purinoceptor 7
Ligand
BDBM242178
Substrate
Meas. Tech.
Binding Assay
IC50
2.60±n/a nM
Citation
 Kilburn, JPRasmussen, LKJessing, MEldemenky, EMChen, BJiang, Y Cyclic amines US Patent  US9593105 Publication Date 3/14/2017 
Target
Name:
P2X purinoceptor 7
Synonyms:
ATP receptor P2RX7_HUMAN P2X purinoceptor 7 (P2X7) P2Z receptor | Purinergic receptor
Type:
Protein
Mol. Mass.:
68602.85
Organism:
Homo sapiens (Human)
Description:
Q99572
Residue:
595
  
Inhibitor
Name:
BDBM242178
Synonyms:
US9415055, (-)2,3-dichloro-N-[2-(4,4-difluoro-1-piperidyl)-2-(2-ethylpyrimidin-5-yl)ethyl]benzamide | US9593105, 180
Type:
Small organic molecule
Emp. Form.:
C20H22Cl2F2N4O
Mol. Mass.:
443.318
SMILES:
CCc1ncc(cn1)C(CNC(=O)c1cccc(Cl)c1Cl)N1CCC(F)(F)CC1
: