Target
P2X purinoceptor 7
Ligand
BDBM242216
Substrate
Meas. Tech.
Binding Assay
IC50
4.20±n/a nM
Citation
 Kilburn, JPRasmussen, LKJessing, MEldemenky, EMChen, BJiang, Y Cyclic amines US Patent  US9593105 Publication Date 3/14/2017 
Target
Name:
P2X purinoceptor 7
Synonyms:
ATP receptor P2RX7_HUMAN P2X purinoceptor 7 (P2X7) P2Z receptor | Purinergic receptor
Type:
Protein
Mol. Mass.:
68602.85
Organism:
Homo sapiens (Human)
Description:
Q99572
Residue:
595
  
Inhibitor
Name:
BDBM242216
Synonyms:
US9415055, (+)2,3-dichloro-N-[2-[6-(difluoromethyl)-3-pyridyl]-2-(4,4-difluoro-1-piperidyl)ethyl]benzamide | US9593105, 218
Type:
Small organic molecule
Emp. Form.:
C20H19Cl2F4N3O
Mol. Mass.:
464.284
SMILES:
FC(F)c1ccc(cn1)C(CNC(=O)c1cccc(Cl)c1Cl)N1CCC(F)(F)CC1
: