Target
Neprilysin
Ligand
BDBM299355
Substrate
Meas. Tech.
Enzyme Inhibition Assay
Ki
<1.00±n/a nM
Citation
 Fleury, MBeausoliel, AHughes, ADLong, DDWilton, DA Neprilysin inhibitors US Patent  US9593110 Publication Date 3/14/2017 
Target
Name:
Neprilysin
Synonyms:
Atriopeptidase CD_antigen=CD10 EPN MME NEP_HUMAN Neutral endopeptidase | Neutral endopeptidase 24.11
Type:
Enzyme
Mol. Mass.:
85505.38
Organism:
Homo sapiens (Human)
Description:
P08473
Residue:
750
  
Inhibitor
Name:
BDBM299355
Synonyms:
US9593110, Example 48a US9593110, Example 49a US9593110, Example 61a US9593110, Example 69a US9593110, Example 75
Type:
Small organic molecule
Emp. Form.:
C22H28BClFNO6S
Mol. Mass.:
499.788
SMILES:
CCOC(=O)[C@H](COS(C)(=O)=O)C[C@@H](Cc1ccc(cc1)-c1cc(Cl)ccc1F)NB(C)O
: