Target
Neprilysin
Ligand
BDBM299369
Substrate
Meas. Tech.
Enzyme Inhibition Assay
Ki
<1.00±n/a nM
Citation
 Fleury, MBeausoliel, AHughes, ADLong, DDWilton, DA Neprilysin inhibitors US Patent  US9593110 Publication Date 3/14/2017 
Target
Name:
Neprilysin
Synonyms:
Atriopeptidase CD_antigen=CD10 EPN MME NEP_HUMAN Neutral endopeptidase | Neutral endopeptidase 24.11
Type:
Enzyme
Mol. Mass.:
85505.38
Organism:
Homo sapiens (Human)
Description:
P08473
Residue:
750
  
Inhibitor
Name:
BDBM299369
Synonyms:
(2R,4R)-5-(5′-Chloro-2′-fluorobiphenyl-4-yl)-2-(2-methoxycarbonylaminoacetylamino)-4-[(1H-[1,2,3]triazole-4-carbonyl)amino]pentanoic Acid | US9593110, Example 67
Type:
Small organic molecule
Emp. Form.:
C24H24ClFN6O6
Mol. Mass.:
546.935
SMILES:
COC(=O)NCC(=O)N[C@H](C[C@@H](Cc1ccc(cc1)-c1cc(Cl)ccc1F)NC(=O)c1c[nH]nn1)C(O)=O
: