Target
Neprilysin
Ligand
BDBM300284
Substrate
Meas. Tech.
Enzyme Inhibition Assay
Ki
<1.00±n/a nM
Citation
 Fleury, MBeausoliel, AHughes, ADLong, DDWilton, DA Neprilysin inhibitors US Patent  US9593110 Publication Date 3/14/2017 
Target
Name:
Neprilysin
Synonyms:
Atriopeptidase CD_antigen=CD10 EPN MME NEP_HUMAN Neutral endopeptidase | Neutral endopeptidase 24.11
Type:
Enzyme
Mol. Mass.:
85505.38
Organism:
Homo sapiens (Human)
Description:
P08473
Residue:
750
  
Inhibitor
Name:
BDBM300284
Synonyms:
US9593110, 4-1
Type:
Small Organic Molecule
Emp. Form.:
C23H22ClF3N4O4
Mol. Mass.:
510.893
SMILES:
COC[C@H](C[C@@H](Cc1ccc(cc1)-c1cccc(Cl)c1)NC(=O)c1n[nH]c(n1)C(F)(F)F)C(O)=O
: