Target
Tyrosine-protein kinase receptor UFO
Ligand
BDBM299902
Substrate
Meas. Tech.
Enzyme Assay
Ki
0.012±n/a nM
Citation
 Johnson, TWRichardson, PFCollins, MRRichter, DTBurke, BJNinkovic, SGajiwala, KSLinton, MALe, PTHoffman, JE Axl inhibitors US Patent  US9593097 Publication Date 3/14/2017 
Target
Name:
Tyrosine-protein kinase receptor UFO
Synonyms:
AXL TEL/AXL UFO | UFO_HUMAN
Type:
Enzyme
Mol. Mass.:
98316.97
Organism:
Homo sapiens (Human)
Description:
P30530
Residue:
894
  
Inhibitor
Name:
BDBM299902
Synonyms:
6-[4-({[2-amino-5- (1-methyl-1H- imidazol-4- yl)pyridin-3- yl]oxy}methyl) piperidin-1-yl]-N- [(2R)- 1-hydroxypropan- 2-yl]-2-[(2R)- tetrahydrofuran-2- ylmethoxy] pyrimidine- 4-carboxamide US9593097, Example 280
Type:
Small organic molecule
Emp. Form.:
C27H37N9O5
Mol. Mass.:
567.64
SMILES:
C[C@H](CO)NC(=O)c1nc(OC[C@H]2CCCO2)nc(n1)N1CCC(COc2cc(cnc2N)-c2cn(C)cn2)CC1
: