Target
Tyrosine-protein kinase receptor UFO
Ligand
BDBM299998
Substrate
Meas. Tech.
Enzyme Assay
Ki
0.015±n/a nM
Citation
 Johnson, TWRichardson, PFCollins, MRRichter, DTBurke, BJNinkovic, SGajiwala, KSLinton, MALe, PTHoffman, JE Axl inhibitors US Patent  US9593097 Publication Date 3/14/2017 
Target
Name:
Tyrosine-protein kinase receptor UFO
Synonyms:
AXL TEL/AXL UFO | UFO_HUMAN
Type:
Enzyme
Mol. Mass.:
98316.97
Organism:
Homo sapiens (Human)
Description:
P30530
Residue:
894
  
Inhibitor
Name:
BDBM299998
Synonyms:
N-[(2R)-1- hydroxypropan-2- yl]-6-[4-(4- methoxy-1H- pyrazolo[3,4- b]pyridin-3- yl)piperidin-1-yl]- 2-[{2R)- tetrahydrofuran-2- ylmethoxy] pyrimidine- 4-carboxamide | US9593097, Example 369
Type:
Small organic molecule
Emp. Form.:
C25H33N7O5
Mol. Mass.:
511.5734
SMILES:
COc1ccnc2[nH]nc(C3CCN(CC3)c3cc(nc(OC[C@H]4CCCO4)n3)C(=O)N[C@H](C)CO)c12
: