Target
Tyrosine-protein kinase receptor UFO
Ligand
BDBM300053
Substrate
Meas. Tech.
Enzyme Assay
Ki
0.049±n/a nM
Citation
 Johnson, TWRichardson, PFCollins, MRRichter, DTBurke, BJNinkovic, SGajiwala, KSLinton, MALe, PTHoffman, JE Axl inhibitors US Patent  US9593097 Publication Date 3/14/2017 
Target
Name:
Tyrosine-protein kinase receptor UFO
Synonyms:
AXL TEL/AXL UFO | UFO_HUMAN
Type:
Enzyme
Mol. Mass.:
98316.97
Organism:
Homo sapiens (Human)
Description:
P30530
Residue:
894
  
Inhibitor
Name:
BDBM300053
Synonyms:
2-[(1- cyanocyclopropyl) methoxy]-N-[(2R)- 1-hydroxypropan- 2-yl]-6-[4-(4- methoxy-1H- pyrazolo[3,4- b]pyridin-3- yl)piperidin-1- yl]pyrimidine-4- carboxamide | US9593097, Example 433
Type:
Small organic molecule
Emp. Form.:
C25H30N8O4
Mol. Mass.:
506.5569
SMILES:
COc1ccnc2[nH]nc(C3CCN(CC3)c3cc(nc(OCC4(CC4)C#N)n3)C(=O)N[C@H](C)CO)c12
: