Target
Cyclin-dependent kinase 1/G2/mitotic-specific cyclin-B
Ligand
BDBM7405
Substrate
Histone H1
Meas. Tech.
Kinase Inhibition Assay
pH
7.2±n/a
Temperature
303.15±n/a K
IC50
92000±n/a nM
Citation
 Polychronopoulos, PMagiatis, PSkaltsounis, ALMyrianthopoulos, VMikros, ETarricone, AMusacchio, ARoe, SMPearl, LLeost, MGreengard, PMeijer, L Structural basis for the synthesis of indirubins as potent and selective inhibitors of glycogen synthase kinase-3 and cyclin-dependent kinases. J Med Chem 47:935-46 (2004)  
Target
Name:
Cyclin-dependent kinase 1/G2/mitotic-specific cyclin-B
Synonyms:
CDK1/Cyclin B p34cdc2/Cyclin B
Type:
Protein Complex
Mol. Mass.:
Description:
p34cdc2/cyclin B was purified from M-phase starfish oocytes by affinity chromatography.
Components:
This complex has 2 components.
Component 1
Name:
Cyclin-dependent kinase 1
Synonyms:
CDK1_ORYLA P34 protein kinase cdk1
Type:
Enzyme Subunit
Mol. Mass.:
34693.35
Organism:
Marthasterias glacialis (starfish)
Description:
Q9DGD3 {empty hard to find)
Residue:
303
  
Component 2
Name:
G2/mitotic-specific cyclin-B
Synonyms:
CCNB_MARGL G2/mitotic-specific cyclin-B1
Type:
Enzyme Subunit
Mol. Mass.:
43790.28
Organism:
Marthasterias glacialis (starfish)
Description:
Residue:
388
  
Inhibitor
Name:
BDBM7405
Synonyms:
(2 Z,3 E)-6-Bromo-1-methylindirubin-3 -oxime 6-bromo-N-methyl-indirubin-3 -oxime | indirubin deriv. 13c
Type:
Small organic molecule
Emp. Form.:
C17H12BrN3O2
Mol. Mass.:
370.2
SMILES:
CN1C(=O)C(c2ccc(Br)cc12)c1[nH]c2ccccc2c1N=O
:
Substrate
Name:
Histone H1
Synonyms:
Type:
Other Protein Type
Mol. Mass.:
358.43
Organism:
Bos taurus (bovine)
Description:
Residue:
3
NA