Target
Cannabinoid receptor 2
Ligand
BDBM300129
Substrate
Meas. Tech.
cAMP Assay
EC50
1.000±n/a nM
Citation
 Grether, UNettekoven, MRogers-Evans, MRoever, SSchmitt, SKimbara, A Triazolo[4,5-D]pyrimidine derivatives US Patent  US9593123 Publication Date 3/14/2017 
Target
Name:
Cannabinoid receptor 2
Synonyms:
CANNABINOID CB2 CB2 CB2B CNR2_HUMAN Cannabinoid CB2 receptor Cannabinoid receptor 2 (CB2R) | hCB2
Type:
G Protein-Coupled Receptor (GPCR)
Mol. Mass.:
39690.94
Organism:
Homo sapiens (Human)
Description:
P34972
Residue:
360
  
Inhibitor
Name:
BDBM300129
Synonyms:
3-[(2-Chlorophenyl)methyl]-5-cyclobutyl-7-(3,3-difluoropyrrolidin-1-yl)triazolo[4,5-d]pyrimidine | US9593123, Example 1
Type:
Small organic molecule
Emp. Form.:
C19H19ClF2N6
Mol. Mass.:
404.844
SMILES:
FC1(F)CCN(C1)c1nc(nc2n(Cc3ccccc3Cl)nnc12)C1CCC1
: