Target
Cannabinoid receptor 2
Ligand
BDBM300158
Substrate
Meas. Tech.
cAMP Assay
EC50
48.6±n/a nM
Citation
 Grether, UNettekoven, MRogers-Evans, MRoever, SSchmitt, SKimbara, A Triazolo[4,5-D]pyrimidine derivatives US Patent  US9593123 Publication Date 3/14/2017 
Target
Name:
Cannabinoid receptor 2
Synonyms:
CANNABINOID CB2 CB2 CB2B CNR2_HUMAN Cannabinoid CB2 receptor Cannabinoid receptor 2 (CB2R) | hCB2
Type:
G Protein-Coupled Receptor (GPCR)
Mol. Mass.:
39690.94
Organism:
Homo sapiens (Human)
Description:
P34972
Residue:
360
  
Inhibitor
Name:
BDBM300158
Synonyms:
(3S)-1-[5-(tert-Butylamino)-3-[(1-methyltetrazol-5-yl)methyl]triazolo[4,5-d]pyrimidin-7-yl]pyrrolidin-3-ol | US9593123, Example 29
Type:
Small organic molecule
Emp. Form.:
C15H23N11O
Mol. Mass.:
373.4162
SMILES:
Cn1nnnc1Cn1nnc2c(nc(NC(C)(C)C)nc12)N1CC[C@H](O)C1
: