Target
Cannabinoid receptor 1
Ligand
BDBM300169
Substrate
EC50
>10000±n/a nM
Citation
 Grether, UNettekoven, MRogers-Evans, MRoever, SSchmitt, SKimbara, A Triazolo[4,5-D]pyrimidine derivatives US Patent  US9593123 Publication Date 3/14/2017 
Target
Name:
Cannabinoid receptor 1
Synonyms:
CANN6 CB-R CNR CNR1_HUMAN Cannabinoid receptor Cannabinoid receptor 1 (brain)
Type:
G Protein-Coupled Receptor (GPCR)
Mol. Mass.:
52868.96
Organism:
Homo sapiens (Human)
Description:
P21554
Residue:
472
  
Inhibitor
Name:
BDBM300169
Synonyms:
3-[(2-Chlorophenyl)methyl]-7-(3,3-difluoropyrrolidin-1-yl)-5-(2,2,2-trifluoroethoxy) triazolo[4,5-d]pyrimidine | US9593123, Example 40
Type:
Small organic molecule
Emp. Form.:
C17H14ClF5N6O
Mol. Mass.:
448.778
SMILES:
FC(F)(F)COc1nc(N2CCC(F)(F)C2)c2nnn(Cc3ccccc3Cl)c2n1
: